Reaction Details
TargetAdenosine receptor A2a
LigandBDBM50139830
Substrate/Competitorn/a
Meas. Tech.ChEBML_1553863
Ki 1.3±n/a nM
Citation Zhou, GAslanian, RGallo, GKhan, TKuang, RPurakkattle, BDe Ruiz, MStamford, ATing, PWu, HWang, HXiao, DYu, TZhang, YMullins, DHodgson, R Discovery of aminoquinazoline derivatives as human A(2A) adenosine receptor antagonists. Bioorg Med Chem Lett26:1348-54 (2016) 
 
Adenosine receptor A2a
Name:Adenosine receptor A2a
Type:G Protein-Coupled Receptor (GPCR)
Mol. Mass.:45015.65
Organism:Rattus norvegicus (rat)
Description:Rat A2A receptors expressed in CHO cells.
Residue:410
BDBM50139830
NameBDBM50139830
Synonyms:CHEMBL3763374
TypeSmall organic molecule
Emp. Form.C20H16FN5O2
Mol. Mass.377.3717
SMILESCOc1ccnc2c(CNC(=O)c3nc(N)nc4c(F)cccc34)cccc12