Reaction Details
TargetLysine-specific histone demethylase 2
LigandBDBM50113851
Substrate/Competitorn/a
Meas. Tech.ChEBML_1554333
IC50 2300000±n/a nM
Citation Kakizawa, TMizukami, TItoh, YHasegawa, MSasaki, RSuzuki, T Evaluation of phenylcyclopropylamine compounds by enzymatic assay of lysine-specific demethylase 2 in the presence of NPAC peptide. Bioorg Med Chem Lett26:1193-5 (2016) 
 
Lysine-specific histone demethylase 2
Name:Lysine-specific histone demethylase 2
Type:PROTEIN
Mol. Mass.:92112.91
Organism:Homo sapiens (Human)
Description:ChEMBL_992590
Residue:822
BDBM50113851
NameBDBM50113851
Synonyms:(+/-)-Tranylcypromine 2-Phenyl-cyclopropylamine CHEMBL313833 Tranylcypromine,(+) US8609708, 6 Tranyl- cypromine | US8609708, 6 Tranylcypromine
TypeSmall organic molecule
Emp. Form.C9H11N
Mol. Mass.133.1903
SMILESNC1CC1c1ccccc1