Reaction Details
TargetHistamine H1 receptor
LigandBDBM50140055
Substrate/Competitorn/a
Meas. Tech.ChEMBL_1550151 (CHEMBL3756492)
Ki 100±n/a nM
Citation Cozzi, NVDaley, PF Receptor binding profiles and quantitative structure-affinity relationships of some 5-substituted-N,N-diallyltryptamines. Bioorg Med Chem Lett26:959-64 (2016) 
 
Histamine H1 receptor
Name:Histamine H1 receptor
Type:G Protein-Coupled Receptor (GPCR)
Mol. Mass.:55808.72
Organism:Homo sapiens (Human)
Description:Cell pellets from SK-N-MC cells transfected with human H1 receptor were used in binding assay.
Residue:487
BDBM50140055
NameBDBM50140055
Synonyms:CHEMBL3754166
TypeSmall organic molecule
Emp. Form.C16H19BrN2
Mol. Mass.319.239
SMILESBrc1ccc2[nH]cc(CCN(CC=C)CC=C)c2c1