Reaction Details
TargetSigma non-opioid intracellular receptor 1
LigandBDBM50140058
Substrate/Competitorn/a
Meas. Tech.ChEMBL_1550155 (CHEMBL3756496)
Ki 100±n/a nM
Citation Cozzi, NVDaley, PF Receptor binding profiles and quantitative structure-affinity relationships of some 5-substituted-N,N-diallyltryptamines. Bioorg Med Chem Lett26:959-64 (2016) 
 
Sigma non-opioid intracellular receptor 1
Name:Sigma non-opioid intracellular receptor 1
Type:Enzyme Catalytic Domain
Mol. Mass.:25124.85
Organism:Homo sapiens (Human)
Description:Q99720
Residue:223
BDBM50140058
NameBDBM50140058
Synonyms:CHEMBL3752576
TypeSmall organic molecule
Emp. Form.C16H20N2
Mol. Mass.240.3434
SMILESC=CCN(CCc1c[nH]c2ccccc12)CC=C