Reaction Details
TargetAlpha-2A adrenergic receptor
LigandBDBM50140054
Substrate/Competitorn/a
Meas. Tech.ChEMBL_1550146 (CHEMBL3756288)
Ki 81±n/a nM
Citation Cozzi, NVDaley, PF Receptor binding profiles and quantitative structure-affinity relationships of some 5-substituted-N,N-diallyltryptamines. Bioorg Med Chem Lett26:959-64 (2016) 
 
Alpha-2A adrenergic receptor
Name:Alpha-2A adrenergic receptor
Type:Enzyme
Mol. Mass.:48979.91
Organism:Homo sapiens (Human)
Description:P08913
Residue:450
BDBM50140054
NameBDBM50140054
Synonyms:CHEMBL3752900
TypeSmall organic molecule
Emp. Form.C16H19ClN2
Mol. Mass.274.788
SMILESClc1ccc2[nH]cc(CCN(CC=C)CC=C)c2c1