Reaction Details
TargetSodium-dependent noradrenaline transporter
LigandBDBM50140056
Substrate/Competitorn/a
Meas. Tech.ChEMBL_1550158 (CHEMBL3756499)
Ki>10000±n/a nM
Citation Cozzi, NVDaley, PF Receptor binding profiles and quantitative structure-affinity relationships of some 5-substituted-N,N-diallyltryptamines. Bioorg Med Chem Lett26:959-64 (2016) 
 
Sodium-dependent noradrenaline transporter
Name:Sodium-dependent noradrenaline transporter
Type:Multi-pass membrane protein
Mol. Mass.:69337.72
Organism:Homo sapiens (Human)
Description:P23975
Residue:617
BDBM50140056
NameBDBM50140056
Synonyms:CHEMBL3753318
TypeSmall organic molecule
Emp. Form.C17H22N2
Mol. Mass.254.37
SMILESCc1ccc2[nH]cc(CCN(CC=C)CC=C)c2c1