Reaction Details
Target5-hydroxytryptamine receptor 2B
LigandBDBM50140055
Substrate/Competitorn/a
Meas. Tech.ChEMBL_1550138 (CHEMBL3756280)
Ki 52±n/a nM
Citation Cozzi, NVDaley, PF Receptor binding profiles and quantitative structure-affinity relationships of some 5-substituted-N,N-diallyltryptamines. Bioorg Med Chem Lett26:959-64 (2016) 
 
5-hydroxytryptamine receptor 2B
Name:5-hydroxytryptamine receptor 2B
Type:G Protein-Coupled Receptor (GPCR)
Mol. Mass.:54312.47
Organism:Homo sapiens (Human)
Description:Receptor binding assays were performed using human clone stably expressed in CHO cells.
Residue:481
BDBM50140055
NameBDBM50140055
Synonyms:CHEMBL3754166
TypeSmall organic molecule
Emp. Form.C16H19BrN2
Mol. Mass.319.239
SMILESBrc1ccc2[nH]cc(CCN(CC=C)CC=C)c2c1