Reaction Details
Target5-hydroxytryptamine receptor 1A
LigandBDBM50140053
Substrate/Competitorn/a
Meas. Tech.ChEMBL_1550133 (CHEMBL3756275)
Ki 79±n/a nM
Citation Cozzi, NVDaley, PF Receptor binding profiles and quantitative structure-affinity relationships of some 5-substituted-N,N-diallyltryptamines. Bioorg Med Chem Lett26:959-64 (2016) 
 
5-hydroxytryptamine receptor 1A
Name:5-hydroxytryptamine receptor 1A
Type:n/a
Mol. Mass.:46122.49
Organism:Homo sapiens (Human)
Description:n/a
Residue:422
BDBM50140053
NameBDBM50140053
Synonyms:CHEMBL3754496
TypeSmall organic molecule
Emp. Form.C16H19FN2
Mol. Mass.258.3339
SMILESFc1ccc2[nH]cc(CCN(CC=C)CC=C)c2c1