Reaction Details
TargetKappa-type opioid receptor
LigandBDBM50140058
Substrate/Competitorn/a
Meas. Tech.ChEMBL_1550153 (CHEMBL3756494)
Ki 2455±n/a nM
Citation Cozzi, NVDaley, PF Receptor binding profiles and quantitative structure-affinity relationships of some 5-substituted-N,N-diallyltryptamines. Bioorg Med Chem Lett26:959-64 (2016) 
 
Kappa-type opioid receptor
Name:Kappa-type opioid receptor
Type:G Protein-Coupled Receptor (GPCR)
Mol. Mass.:42648.76
Organism:Homo sapiens (Human)
Description:P41145
Residue:380
BDBM50140058
NameBDBM50140058
Synonyms:CHEMBL3752576
TypeSmall organic molecule
Emp. Form.C16H20N2
Mol. Mass.240.3434
SMILESC=CCN(CCc1c[nH]c2ccccc12)CC=C