Reaction Details
TargetAlpha-2A adrenergic receptor
LigandBDBM50140055
Substrate/Competitorn/a
Meas. Tech.ChEMBL_1550146 (CHEMBL3756288)
Ki 83±n/a nM
Citation Cozzi, NVDaley, PF Receptor binding profiles and quantitative structure-affinity relationships of some 5-substituted-N,N-diallyltryptamines. Bioorg Med Chem Lett26:959-64 (2016) 
 
Alpha-2A adrenergic receptor
Name:Alpha-2A adrenergic receptor
Type:Enzyme
Mol. Mass.:48979.91
Organism:Homo sapiens (Human)
Description:P08913
Residue:450
BDBM50140055
NameBDBM50140055
Synonyms:CHEMBL3754166
TypeSmall organic molecule
Emp. Form.C16H19BrN2
Mol. Mass.319.239
SMILESBrc1ccc2[nH]cc(CCN(CC=C)CC=C)c2c1