Reaction Details
Target5-hydroxytryptamine receptor 6
LigandBDBM50140056
Substrate/Competitorn/a
Meas. Tech.ChEMBL_1550141 (CHEMBL3756283)
Ki 741±n/a nM
Citation Cozzi, NVDaley, PF Receptor binding profiles and quantitative structure-affinity relationships of some 5-substituted-N,N-diallyltryptamines. Bioorg Med Chem Lett26:959-64 (2016) 
 
5-hydroxytryptamine receptor 6
Name:5-hydroxytryptamine receptor 6
Type:G Protein-Coupled Receptor (GPCR)
Mol. Mass.:46968.43
Organism:Homo sapiens (Human)
Description:P50406
Residue:440
BDBM50140056
NameBDBM50140056
Synonyms:CHEMBL3753318
TypeSmall organic molecule
Emp. Form.C17H22N2
Mol. Mass.254.37
SMILESCc1ccc2[nH]cc(CCN(CC=C)CC=C)c2c1