Reaction Details
TargetSodium-dependent serotonin transporter
LigandBDBM50140053
Substrate/Competitorn/a
Meas. Tech.ChEMBL_1550159 (CHEMBL3756500)
Ki 36±n/a nM
Citation Cozzi, NVDaley, PF Receptor binding profiles and quantitative structure-affinity relationships of some 5-substituted-N,N-diallyltryptamines. Bioorg Med Chem Lett26:959-64 (2016) 
 
Sodium-dependent serotonin transporter
Name:Sodium-dependent serotonin transporter
Type:Multi-pass membrane protein
Mol. Mass.:70322.51
Organism:Homo sapiens (Human)
Description:P31645
Residue:630
BDBM50140053
NameBDBM50140053
Synonyms:CHEMBL3754496
TypeSmall organic molecule
Emp. Form.C16H19FN2
Mol. Mass.258.3339
SMILESFc1ccc2[nH]cc(CCN(CC=C)CC=C)c2c1