Reaction Details
TargetBeta-galactosidase
LigandBDBM50140061
Substrate/Competitorn/a
Meas. Tech.ChEMBL_1550167 (CHEMBL3756508)
Ki 1.3±n/a nM
Citation Fan, QHPickens, JBStriegler, SGervaise, CD Illuminating the binding interactions of galactonoamidines during the inhibition of฿-galactosidase (E. coli). Bioorg Med Chem24:661-71 (2016) 
 
Beta-galactosidase
Name:Beta-galactosidase
Type:PROTEIN
Mol. Mass.:116943.87
Organism:Escherichia coli
Description:ChEMBL_215882
Residue:1029
BDBM50140061
NameBDBM50140061
Synonyms:CHEMBL3752112
TypeSmall organic molecule
Emp. Form.C14H20N2O3
Mol. Mass.264.3202
SMILESCc1ccc(CNC2=N[C@H](CO)[C@H](O)[C@H](O)C2)cc1