Reaction Details
Target5-hydroxytryptamine receptor 2C
LigandBDBM50001915
Substrate/Competitorn/a
Meas. Tech.ChEMBL_1547211 (CHEMBL3756318)
Ki 28±n/a nM
Citation Éliás, ONógrádi, KDomány, GSzakács, ZKóti, JSzántay, CTarcsay, ÁKeseru, GMGere, AKiss, BKurkó, DKolok, SNémethy, ZKapui, ZHellinger, ÉVastag, MSághy, KKedves, RGyertyán, I The influence of 5-HT(2A) activity on a 5-HT(2C) specific in vivo assay used for early identification of multiple acting SERT and 5-HT(2C) receptor ligands. Bioorg Med Chem Lett26:914-20 (2016) 
 
5-hydroxytryptamine receptor 2C
Name:5-hydroxytryptamine receptor 2C
Type:G Protein-Coupled Receptor (GPCR)
Mol. Mass.:51836.79
Organism:Homo sapiens (Human)
Description:P28335
Residue:458
BDBM50001915
NameBDBM50001915
Synonyms:1-(3-chlorophenyl)piperazine m-Chlorophenylpiperazine | mCPP
TypeSmall organic molecule
Emp. Form.C10H13ClN2
Mol. Mass.196.677
SMILESClc1cccc(c1)N1CCNCC1