Reaction Details
TargetAmino acid transporter
LigandBDBM50140084
Substrate/Competitorn/a
Meas. Tech.ChEMBL_1547439 (CHEMBL3757558)
IC50 86400±n/a nM
Citation Schulte, MLKhodadadi, ABCuthbertson, MLSmith, JAManning, HC 2-Amino-4-bis(aryloxybenzyl)aminobutanoic acids: A novel scaffold for inhibition of ASCT2-mediated glutamine transport. Bioorg Med Chem Lett26:1044-7 (2016) 
 
Amino acid transporter
Name:Amino acid transporter
Type:PROTEIN
Mol. Mass.:56758.53
Organism:Rattus norvegicus
Description:ChEMBL_109757
Residue:539
BDBM50140084
NameBDBM50140084
Synonyms:CHEMBL3753993
TypeSmall organic molecule
Emp. Form.C34H38N2O4
Mol. Mass.538.6765
SMILESCc1ccc(COc2ccccc2CN(CC[C@H](N)C(O)=O)Cc2ccccc2OCc2ccc(C)cc2)cc1