Reaction Details
TargetAmino acid transporter
LigandBDBM50140130
Substrate/Competitorn/a
Meas. Tech.ChEMBL_1547439 (CHEMBL3757558)
IC50 36300±n/a nM
Citation Schulte, MLKhodadadi, ABCuthbertson, MLSmith, JAManning, HC 2-Amino-4-bis(aryloxybenzyl)aminobutanoic acids: A novel scaffold for inhibition of ASCT2-mediated glutamine transport. Bioorg Med Chem Lett26:1044-7 (2016) 
 
Amino acid transporter
Name:Amino acid transporter
Type:PROTEIN
Mol. Mass.:56758.53
Organism:Rattus norvegicus
Description:ChEMBL_109757
Residue:539
BDBM50140130
NameBDBM50140130
Synonyms:CHEMBL3752483
TypeSmall organic molecule
Emp. Form.C30H28F2N2O4
Mol. Mass.518.5511
SMILESN[C@@H](CCN(Cc1ccccc1Oc1cccc(F)c1)Cc1ccccc1Oc1cccc(F)c1)C(O)=O