Reaction Details
TargetTransient receptor potential cation channel subfamily V member 1
LigandBDBM50131688
Substrate/Competitorn/a
Meas. Tech.ChEBML_1547635
IC50>10000±n/a nM
Citation Nalli, MOrtar, GMoriello, ASMorera, EDi Marzo, VDe Petrocellis, L TRPA1 channels as targets for resveratrol and related stilbenoids. Bioorg Med Chem Lett26:899-902 (2016) 
 
Transient receptor potential cation channel subfamily V member 1
Name:Transient receptor potential cation channel subfamily V member 1
Type:Protein
Mol. Mass.:94960.75
Organism:Homo sapiens (Human)
Description:Q8NER1
Residue:839
BDBM50131688
NameBDBM50131688
Synonyms:(E)-4-(3,5-dimethoxystyryl)phenol 4'-hydroxy-3,5-dimethoxy stilbene 4-[(E)-2-(3,5-Dimethoxy-phenyl)-vinyl]-phenol CHEMBL83527 Pterostilben | Pterostilbene
TypeSmall organic molecule
Emp. Form.C16H16O3
Mol. Mass.256.2964
SMILESCOc1cc(OC)cc(\C=C\c2ccc(O)cc2)c1