Reaction Details
TargetAcetylcholinesterase
LigandBDBM10620
Substrate/Competitorn/a
Meas. Tech.ChEMBL_1547640 (CHEMBL3755510)
IC50 6350±n/a nM
Citation Luo, WChen, YWang, THong, CChang, LPChang, CCYang, YCXie, SQWang, CJ Design, synthesis and evaluation of novel 7-aminoalkyl-substituted flavonoid derivatives with improved cholinesterase inhibitory activities. Bioorg Med Chem24:672-80 (2016) 
 
Acetylcholinesterase
Name:Acetylcholinesterase
Type:Enzyme
Mol. Mass.:71812.79
Organism:Electrophorus electricus (Electric eel)
Description:n/a
Residue:633
BDBM10620
NameBDBM10620
Synonyms:(S)-3-(1-(dimethylamino)ethyl)phenyl ethyl(methyl)carbamate 3-(1-(dimethylamino)ethyl)phenyl ethyl(methyl)carbamate CHEMBL636 Ethyl-methyl-carbamic acid 3-((R)-1-dimethylamino-ethyl)-phenyl ester Ethyl-methyl-carbamic acid 3-(1-dimethylamino-ethyl)-phenyl ester Rivastigmine SDZ-212-713 | SDZ-ENA-713
TypeSmall organic molecule
Emp. Form.C14H22N2O2
Mol. Mass.250.3367
SMILES[H][C@@](C)(N(C)C)c1cccc(OC(=O)N(C)CC)c1