Reaction Details
TargetExtracellular calcium-sensing receptor
LigandBDBM50404271
Substrate/Competitorn/a
Meas. Tech.ChEMBL_1547654 (CHEMBL3755705)
EC50 132±n/a nM
Citation Kiefer, LBeaumard, FGorojankina, TFaure, HRuat, MDodd, RH Design and synthesis of calindol derivatives as potent and selective calcium sensing receptor agonists. Bioorg Med Chem24:554-69 (2016) 
 
Extracellular calcium-sensing receptor
Name:Extracellular calcium-sensing receptor
Type:PROTEIN
Mol. Mass.:120858.46
Organism:Rattus norvegicus
Description:ChEMBL_750426
Residue:1079
BDBM50404271
NameBDBM50404271
Synonyms:CHEMBL2092942
TypeSmall organic molecule
Emp. Form.C21H20N2
Mol. Mass.300.3969
SMILESC[C@@H](NCc1cc2ccccc2[nH]1)c1cccc2ccccc12