Reaction Details
TargetExtracellular calcium-sensing receptor
LigandBDBM50140170
Substrate/Competitorn/a
Meas. Tech.ChEMBL_1547654 (CHEMBL3755705)
EC50 102±n/a nM
Citation Kiefer, LBeaumard, FGorojankina, TFaure, HRuat, MDodd, RH Design and synthesis of calindol derivatives as potent and selective calcium sensing receptor agonists. Bioorg Med Chem24:554-69 (2016) 
 
Extracellular calcium-sensing receptor
Name:Extracellular calcium-sensing receptor
Type:PROTEIN
Mol. Mass.:120858.46
Organism:Rattus norvegicus
Description:ChEMBL_750426
Residue:1079
BDBM50140170
NameBDBM50140170
Synonyms:CHEMBL3754639
TypeSmall organic molecule
Emp. Form.C21H20N2O
Mol. Mass.316.3963
SMILESC[C@@H](NCc1cc2c(O)cccc2[nH]1)c1cccc2ccccc12