Reaction Details
TargetCollagenase 3
LigandBDBM50140176
Substrate/Competitorn/a
Meas. Tech.ChEMBL_1547678 (CHEMBL3755729)
IC50>100000±n/a nM
Citation Ai, TQiu, LXie, JGeraghty, RJChen, L Design and synthesis of an activity-based protein profiling probe derived from cinnamic hydroxamic acid. Bioorg Med Chem24:686-92 (2016) 
 
Collagenase 3
Name:Collagenase 3
Type:Enzyme
Mol. Mass.:53808.06
Organism:Homo sapiens (Human)
Description:P45452
Residue:471
BDBM50140176
NameBDBM50140176
Synonyms:CHEMBL3394285
TypeSmall organic molecule
Emp. Form.C10H8F3NO2
Mol. Mass.231.1712
SMILESONC(=O)\C=C\c1ccc(cc1)C(F)(F)F