Reaction Details
TargetE3 ubiquitin-protein ligase Mdm2
LigandBDBM50140250
Substrate/Competitorn/a
Meas. Tech.ChEMBL_1548129 (CHEMBL3754931)
Kd 17700±n/a nM
Citation Wójcik, PBerlicki, L Peptide-based inhibitors of protein-protein interactions. Bioorg Med Chem Lett26:707-13 (2016) 
 
E3 ubiquitin-protein ligase Mdm2
Name:E3 ubiquitin-protein ligase Mdm2
Type:Oncoprotein
Mol. Mass.:55196.54
Organism:Homo sapiens (Human)
Description:Q00987
Residue:491
BDBM50140250
NameBDBM50140250
Synonyms:CHEMBL3754073
TypeSmall organic molecule
Emp. Form.C97H140N28O24S4
Mol. Mass.2210.583
SMILES[H][C@@]12CCCN1C(=O)[C@H](C)NC(=O)[C@H](CCCCN)NC(=O)[C@]1([H])CSSC[C@]([H])(NC(=O)[C@H](CC(C)C)NC(=O)[C@H](Cc3ccccc3)NC(=O)[C@@]([H])(NC(=O)[C@H](CCC(O)=O)NC2=O)[C@@H](C)O)C(=O)N[C@@H](Cc2ccc(O)cc2)C(=O)N[C@@H](Cc2c[nH]c3ccccc23)C(=O)N[C@@H](CCCNC(N)=N)C(=O)N[C@@H](CSSC[C@H](N)C(=O)N[C@@H](CC(N)=O)C(=O)N1)C(=O)N[C@@H](CC(C)C)C(=O)N[C@@H](CCC(N)=O)C(=O)N[C@@H](Cc1cnc[nH]1)C(N)=O