Reaction Details
TargetPhosphatidylinositol 4,5-bisphosphate 3-kinase catalytic subunit alpha isoform
LigandBDBM50140267
Substrate/Competitorn/a
Meas. Tech.ChEMBL_1548418 (CHEMBL3756403)
IC50 3.0±n/a nM
Citation Han, WMenezes, DLXu, YKnapp, MSElling, RBurger, MTNi, ZJSmith, ALan, JWilliams, TEVerhagen, JHuh, KMerritt, HChan, JKaufman, SVoliva, CFPecchi, S Discovery of imidazo[1,2-a]-pyridine inhibitors of pan-PI3 kinases that are efficacious in a mouse xenograft model. Bioorg Med Chem Lett26:742-6 (2016) 
 
Phosphatidylinositol 4,5-bisphosphate 3-kinase catalytic subunit alpha isoform
Name:Phosphatidylinositol 4,5-bisphosphate 3-kinase catalytic subunit alpha isoform
Type:Enzyme Subunit
Mol. Mass.:124294.87
Organism:Homo sapiens (Human)
Description:P42336
Residue:1068
BDBM50140267
NameBDBM50140267
Synonyms:CHEMBL3752019
TypeSmall organic molecule
Emp. Form.C15H13F3N6O2
Mol. Mass.366.2979
SMILESCC(=O)Nc1cn2cc(ccc2n1)-c1cnc(N)c(OCC(F)(F)F)n1