Reaction Details
TargetAdenosine receptor A1
LigandBDBM50140279
Substrate/Competitorn/a
Meas. Tech.ChEMBL_1548613 (CHEMBL3757432)
Ki 0.175000±n/a nM
Citation Robinson, SJPetzer, JPRousseau, ALTerre'Blanche, GPetzer, ALourens, AC Carbamate substituted 2-amino-4,6-diphenylpyrimidines as adenosine receptor antagonists. Bioorg Med Chem Lett26:734-8 (2016) 
 
Adenosine receptor A1
Name:Adenosine receptor A1
Type:Protein
Mol. Mass.:36704.13
Organism:Rattus norvegicus (rat)
Description:n/a
Residue:326
BDBM50140279
NameBDBM50140279
Synonyms:CHEMBL3754252
TypeSmall organic molecule
Emp. Form.C23H26N4O2
Mol. Mass.390.4781
SMILESCC(C)N(C(C)C)C(=O)Oc1cccc(c1)-c1cc(nc(N)n1)-c1ccccc1