Reaction Details
TargetAdenosine receptor A1
LigandBDBM50140307
Substrate/Competitorn/a
Meas. Tech.ChEMBL_1548613 (CHEMBL3757432)
Ki 0.835000±n/a nM
Citation Robinson, SJPetzer, JPRousseau, ALTerre'Blanche, GPetzer, ALourens, AC Carbamate substituted 2-amino-4,6-diphenylpyrimidines as adenosine receptor antagonists. Bioorg Med Chem Lett26:734-8 (2016) 
 
Adenosine receptor A1
Name:Adenosine receptor A1
Type:Protein
Mol. Mass.:36704.13
Organism:Rattus norvegicus (rat)
Description:n/a
Residue:326
BDBM50140307
NameBDBM50140307
Synonyms:CHEMBL3754358
TypeSmall organic molecule
Emp. Form.C21H20N4O2
Mol. Mass.360.4091
SMILESNc1nc(cc(n1)-c1cccc(OC(=O)N2CCCC2)c1)-c1ccccc1