Reaction Details
TargetAdenosine receptor A1
LigandBDBM50140312
Substrate/Competitorn/a
Meas. Tech.ChEMBL_1548613 (CHEMBL3757432)
Ki 2.7±n/a nM
Citation Robinson, SJPetzer, JPRousseau, ALTerre'Blanche, GPetzer, ALourens, AC Carbamate substituted 2-amino-4,6-diphenylpyrimidines as adenosine receptor antagonists. Bioorg Med Chem Lett26:734-8 (2016) 
 
Adenosine receptor A1
Name:Adenosine receptor A1
Type:Protein
Mol. Mass.:36704.13
Organism:Rattus norvegicus (rat)
Description:n/a
Residue:326
BDBM50140312
NameBDBM50140312
Synonyms:CHEMBL3754167
TypeSmall organic molecule
Emp. Form.C21H20N4O3
Mol. Mass.376.4085
SMILESNc1nc(cc(n1)-c1cccc(OC(=O)N2CCOCC2)c1)-c1ccccc1