Reaction Details
TargetAdenosine receptor A2a
LigandBDBM50140286
Substrate/Competitorn/a
Meas. Tech.ChEMBL_1548614 (CHEMBL3757433)
Ki 52±n/a nM
Citation Robinson, SJPetzer, JPRousseau, ALTerre'Blanche, GPetzer, ALourens, AC Carbamate substituted 2-amino-4,6-diphenylpyrimidines as adenosine receptor antagonists. Bioorg Med Chem Lett26:734-8 (2016) 
 
Adenosine receptor A2a
Name:Adenosine receptor A2a
Type:G Protein-Coupled Receptor (GPCR)
Mol. Mass.:45015.65
Organism:Rattus norvegicus (rat)
Description:Rat A2A receptors expressed in CHO cells.
Residue:410
BDBM50140286
NameBDBM50140286
Synonyms:CHEMBL3751996
TypeSmall organic molecule
Emp. Form.C19H18N4O2
Mol. Mass.334.3718
SMILESCN(C)C(=O)Oc1cccc(c1)-c1cc(nc(N)n1)-c1ccccc1