Reaction Details
TargetAdenosine receptor A2a
LigandBDBM50140312
Substrate/Competitorn/a
Meas. Tech.ChEMBL_1548614 (CHEMBL3757433)
Ki 3.5±n/a nM
Citation Robinson, SJPetzer, JPRousseau, ALTerre'Blanche, GPetzer, ALourens, AC Carbamate substituted 2-amino-4,6-diphenylpyrimidines as adenosine receptor antagonists. Bioorg Med Chem Lett26:734-8 (2016) 
 
Adenosine receptor A2a
Name:Adenosine receptor A2a
Type:G Protein-Coupled Receptor (GPCR)
Mol. Mass.:45015.65
Organism:Rattus norvegicus (rat)
Description:Rat A2A receptors expressed in CHO cells.
Residue:410
BDBM50140312
NameBDBM50140312
Synonyms:CHEMBL3754167
TypeSmall organic molecule
Emp. Form.C21H20N4O3
Mol. Mass.376.4085
SMILESNc1nc(cc(n1)-c1cccc(OC(=O)N2CCOCC2)c1)-c1ccccc1