Reaction Details
TargetLysine-specific demethylase 6B
LigandBDBM50140567
Substrate/Competitorn/a
Meas. Tech.ChEMBL_1548620 (CHEMBL3757620)
IC50 200±n/a nM
Citation Hu, JWang, XChen, LHuang, MTang, WZuo, JLiu, YCShi, ZLiu, RShen, JXiong, B Design and discovery of new pyrimidine coupled nitrogen aromatic rings as chelating groups of JMJD3 inhibitors. Bioorg Med Chem Lett26:721-5 (2016) 
 
Lysine-specific demethylase 6B
Name:Lysine-specific demethylase 6B
Type:Protein
Mol. Mass.:176672.55
Organism:Homo sapiens (Human)
Description:O15054
Residue:1643
BDBM50140567
NameBDBM50140567
Synonyms:CHEMBL3752893
TypeSmall organic molecule
Emp. Form.C20H21N5O2S
Mol. Mass.395.478
SMILESOC(=O)CCNc1nc(cc(n1)-c1nccs1)N1CCc2ccccc2CC1