Reaction Details
TargetLysine-specific demethylase 6B
LigandBDBM50140573
Substrate/Competitorn/a
Meas. Tech.ChEMBL_1548620 (CHEMBL3757620)
IC50 940±n/a nM
Citation Hu, JWang, XChen, LHuang, MTang, WZuo, JLiu, YCShi, ZLiu, RShen, JXiong, B Design and discovery of new pyrimidine coupled nitrogen aromatic rings as chelating groups of JMJD3 inhibitors. Bioorg Med Chem Lett26:721-5 (2016) 
 
Lysine-specific demethylase 6B
Name:Lysine-specific demethylase 6B
Type:Protein
Mol. Mass.:176672.55
Organism:Homo sapiens (Human)
Description:O15054
Residue:1643
BDBM50140573
NameBDBM50140573
Synonyms:CHEMBL3752343
TypeSmall organic molecule
Emp. Form.C20H20Cl2N6O2S
Mol. Mass.479.383
SMILESOC(=O)CCNc1nc(cc(n1)-c1nccs1)N1CCN(CC1)c1ccc(Cl)c(Cl)c1