Reaction Details
TargetLysine-specific demethylase 6B
LigandBDBM50140681
Substrate/Competitorn/a
Meas. Tech.ChEMBL_1548620 (CHEMBL3757620)
IC50 1500±n/a nM
Citation Hu, JWang, XChen, LHuang, MTang, WZuo, JLiu, YCShi, ZLiu, RShen, JXiong, B Design and discovery of new pyrimidine coupled nitrogen aromatic rings as chelating groups of JMJD3 inhibitors. Bioorg Med Chem Lett26:721-5 (2016) 
 
Lysine-specific demethylase 6B
Name:Lysine-specific demethylase 6B
Type:Protein
Mol. Mass.:176672.55
Organism:Homo sapiens (Human)
Description:O15054
Residue:1643
BDBM50140681
NameBDBM50140681
Synonyms:CHEMBL3753787
TypeSmall organic molecule
Emp. Form.C18H19N7O2
Mol. Mass.365.3892
SMILESOC(=O)CCNc1nc(cc(n1)-n1nccn1)N1CCc2ccccc2C1