Reaction Details
TargetPeriod circadian protein homolog 2
LigandBDBM50140700
Substrate/Competitorn/a
Meas. Tech.ChEMBL_1548653 (CHEMBL3757653)
EC50 1177±n/a nM
Citation Humphries, PSBersot, RKincaid, JMabery, EMcCluskie, KPark, TRenner, TRiegler, ESteinfeld, TTurtle, EDWei, ZLWillis, E Carbazole-containing sulfonamides and sulfamides: Discovery of cryptochrome modulators as antidiabetic agents. Bioorg Med Chem Lett26:757-60 (2016) 
 
Period circadian protein homolog 2
Name:Period circadian protein homolog 2
Type:PROTEIN
Mol. Mass.:136576.47
Organism:Homo sapiens (Human)
Description:ChEMBL_116705
Residue:1255
BDBM50140700
NameBDBM50140700
Synonyms:CHEMBL3754797 | US10383880, Example 85
TypeSmall organic molecule
Emp. Form.C24H26N2O5S
Mol. Mass.454.539
SMILESOC(CN(Cc1ccco1)S(=O)(=O)C1CCOC1)Cn1c2ccccc2c2ccccc12