Reaction Details
TargetPeriod circadian protein homolog 2
LigandBDBM50140702
Substrate/Competitorn/a
Meas. Tech.ChEMBL_1548653 (CHEMBL3757653)
EC50 516±n/a nM
Citation Humphries, PSBersot, RKincaid, JMabery, EMcCluskie, KPark, TRenner, TRiegler, ESteinfeld, TTurtle, EDWei, ZLWillis, E Carbazole-containing sulfonamides and sulfamides: Discovery of cryptochrome modulators as antidiabetic agents. Bioorg Med Chem Lett26:757-60 (2016) 
 
Period circadian protein homolog 2
Name:Period circadian protein homolog 2
Type:PROTEIN
Mol. Mass.:136576.47
Organism:Homo sapiens (Human)
Description:ChEMBL_116705
Residue:1255
BDBM50140702
NameBDBM50140702
Synonyms:CHEMBL3753702 | US10383880, Example 3
TypeSmall organic molecule
Emp. Form.C23H26N2O4S
Mol. Mass.426.529
SMILESCCCS(=O)(=O)N(CC(O)Cn1c2ccccc2c2ccccc12)Cc1ccco1