Reaction Details
TargetPeriod circadian protein homolog 2
LigandBDBM56256
Substrate/Competitorn/a
Meas. Tech.ChEMBL_1548653 (CHEMBL3757653)
EC50 870±n/a nM
Citation Humphries, PSBersot, RKincaid, JMabery, EMcCluskie, KPark, TRenner, TRiegler, ESteinfeld, TTurtle, EDWei, ZLWillis, E Carbazole-containing sulfonamides and sulfamides: Discovery of cryptochrome modulators as antidiabetic agents. Bioorg Med Chem Lett26:757-60 (2016) 
 
Period circadian protein homolog 2
Name:Period circadian protein homolog 2
Type:PROTEIN
Mol. Mass.:136576.47
Organism:Homo sapiens (Human)
Description:ChEMBL_116705
Residue:1255
BDBM56256
NameBDBM56256
Synonyms:MLS000110334 N-(3-carbazol-9-yl-2-hydroxypropyl)-N-(furan-2-ylmethyl)methanesulfonamide N-[3-(9-carbazolyl)-2-hydroxypropyl]-N-(2-furanylmethyl)methanesulfonamide US10383880, Example 1 | cid_2888648
TypeSmall organic molecule
Emp. Form.C21H22N2O4S
Mol. Mass.398.475
SMILESCS(=O)(=O)N(CC(O)Cn1c2ccccc2c2ccccc12)Cc1ccco1