Reaction Details
TargetPeriod circadian protein homolog 2
LigandBDBM50140749
Substrate/Competitorn/a
Meas. Tech.ChEMBL_1548653 (CHEMBL3757653)
EC50 532±n/a nM
Citation Humphries, PSBersot, RKincaid, JMabery, EMcCluskie, KPark, TRenner, TRiegler, ESteinfeld, TTurtle, EDWei, ZLWillis, E Carbazole-containing sulfonamides and sulfamides: Discovery of cryptochrome modulators as antidiabetic agents. Bioorg Med Chem Lett26:757-60 (2016) 
 
Period circadian protein homolog 2
Name:Period circadian protein homolog 2
Type:PROTEIN
Mol. Mass.:136576.47
Organism:Homo sapiens (Human)
Description:ChEMBL_116705
Residue:1255
BDBM50140749
NameBDBM50140749
Synonyms:CHEMBL3752740 | US10383880, Example 71
TypeSmall organic molecule
Emp. Form.C22H28N2O3S
Mol. Mass.400.534
SMILESCS(=O)(=O)N(CC(O)Cn1c2ccccc2c2ccccc12)C1CCCCC1