Reaction Details
TargetPeriod circadian protein homolog 2
LigandBDBM50140756
Substrate/Competitorn/a
Meas. Tech.ChEMBL_1548653 (CHEMBL3757653)
EC50 819±n/a nM
Citation Humphries, PSBersot, RKincaid, JMabery, EMcCluskie, KPark, TRenner, TRiegler, ESteinfeld, TTurtle, EDWei, ZLWillis, E Carbazole-containing sulfonamides and sulfamides: Discovery of cryptochrome modulators as antidiabetic agents. Bioorg Med Chem Lett26:757-60 (2016) 
 
Period circadian protein homolog 2
Name:Period circadian protein homolog 2
Type:PROTEIN
Mol. Mass.:136576.47
Organism:Homo sapiens (Human)
Description:ChEMBL_116705
Residue:1255
BDBM50140756
NameBDBM50140756
Synonyms:CHEMBL3753763
TypeSmall organic molecule
Emp. Form.C21H26N2O4S
Mol. Mass.402.507
SMILESCS(=O)(=O)N(CC(O)Cn1c2ccccc2c2ccccc12)C1CCOCC1