Reaction Details
TargetKinesin-like protein KIF20A
LigandBDBM50140931
Substrate/Competitorn/a
Meas. Tech.ChEMBL_1548834 (CHEMBL3755390)
IC50 4200±n/a nM
Citation Labrière, CTalapatra, SKThoret, SBougeret, CKozielski, FGuillou, C New MKLP-2 inhibitors in the paprotrain series: Design, synthesis and biological evaluations. Bioorg Med Chem24:721-34 (2016) 
 
Kinesin-like protein KIF20A
Name:Kinesin-like protein KIF20A
Type:PROTEIN
Mol. Mass.:100281.35
Organism:Homo sapiens (Human)
Description:ChEMBL_104520
Residue:890
BDBM50140931
NameBDBM50140931
Synonyms:CHEMBL3753782
TypeSmall organic molecule
Emp. Form.C17H13N3O
Mol. Mass.275.3046
SMILESCOc1cccc2[nH]cc(\C(=C\c3cccnc3)C#N)c12