Reaction Details
TargetKinesin-like protein KIF20A
LigandBDBM50140933
Substrate/Competitorn/a
Meas. Tech.ChEMBL_1548836 (CHEMBL3755392)
IC50 34500±n/a nM
Citation Labrière, CTalapatra, SKThoret, SBougeret, CKozielski, FGuillou, C New MKLP-2 inhibitors in the paprotrain series: Design, synthesis and biological evaluations. Bioorg Med Chem24:721-34 (2016) 
 
Kinesin-like protein KIF20A
Name:Kinesin-like protein KIF20A
Type:PROTEIN
Mol. Mass.:100281.35
Organism:Homo sapiens (Human)
Description:ChEMBL_104520
Residue:890
BDBM50140933
NameBDBM50140933
Synonyms:CHEMBL3753648
TypeSmall organic molecule
Emp. Form.C16H11N3
Mol. Mass.245.2786
SMILESN#C\C(=C/c1c[nH]c2ccccc12)c1cccnc1