Reaction Details
TargetHistone deacetylase 3
LigandBDBM19149
Substrate/Competitorn/a
Meas. Tech.ChEMBL_1551264 (CHEMBL3762115)
IC50 55±n/a nM
Citation Thaler, FMoretti, LAmici, RAbate, AColombo, ACarenzi, GFulco, MCBoggio, RDondio, GGagliardi, SMinucci, SSartori, LVarasi, MMercurio, C Synthesis, biological characterization and molecular modeling insights of spirochromanes as potent HDAC inhibitors. Eur J Med Chem108:53-67 (2016) 
 
Histone deacetylase 3
Name:Histone deacetylase 3
Type:Enzyme
Mol. Mass.:48829.55
Organism:Homo sapiens (Human)
Description:O15379
Residue:428
BDBM19149
NameBDBM19149
Synonyms:CHEMBL98 SAHA US10188756, Compound SAHA US11505523, Compound SAHA US9353061, SAHA US9695181, Vorinostat Zolinza suberoylanilide hydroxamic acid
TypeSmall organic molecule
Emp. Form.C14H20N2O3
Mol. Mass.264.3202
SMILESONC(=O)CCCCCCC(=O)Nc1ccccc1