Reaction Details
TargetProstaglandin E synthase
LigandBDBM50393041
Substrate/Competitorn/a
Meas. Tech.ChEMBL_1552423 (CHEMBL3761674)
IC50 2770±n/a nM
Citation Schiffler, MAAntonysamy, SBhattachar, SNCampanale, KMChandrasekhar, SCondon, BDesai, PVFisher, MJGroshong, CHarvey, AHickey, MJHughes, NEJones, SAKim, EJKuklish, SLLuz, JGNorman, BHRathmell, RERizzo, JRSeng, TWThibodeaux, SJWoods, TAYork, JSYu, XP Discovery and Characterization of 2-Acylaminoimidazole Microsomal Prostaglandin E Synthase-1 Inhibitors. J Med Chem59:194-205 (2016) 
 
Prostaglandin E synthase
Name:Prostaglandin E synthase
Type:Protein
Mol. Mass.:17112.22
Organism:Homo sapiens (Human)
Description:n/a
Residue:152
BDBM50393041
NameBDBM50393041
Synonyms:CHEMBL2152711
TypeSmall organic molecule
Emp. Form.C15H17ClN4O2
Mol. Mass.320.774
SMILESCC(C)C(=O)NCc1ccc(Cl)c(c1)C(=O)Nc1ncc[nH]1