Reaction Details
TargetProstaglandin E synthase
LigandBDBM50393040
Substrate/Competitorn/a
Meas. Tech.ChEMBL_1552424 (CHEMBL3761675)
IC50 607±n/a nM
Citation Schiffler, MAAntonysamy, SBhattachar, SNCampanale, KMChandrasekhar, SCondon, BDesai, PVFisher, MJGroshong, CHarvey, AHickey, MJHughes, NEJones, SAKim, EJKuklish, SLLuz, JGNorman, BHRathmell, RERizzo, JRSeng, TWThibodeaux, SJWoods, TAYork, JSYu, XP Discovery and Characterization of 2-Acylaminoimidazole Microsomal Prostaglandin E Synthase-1 Inhibitors. J Med Chem59:194-205 (2016) 
 
Prostaglandin E synthase
Name:Prostaglandin E synthase
Type:Protein
Mol. Mass.:17112.22
Organism:Homo sapiens (Human)
Description:n/a
Residue:152
BDBM50393040
NameBDBM50393040
Synonyms:CHEMBL2152710
TypeSmall organic molecule
Emp. Form.C16H19BrN4O2
Mol. Mass.379.252
SMILESCC(C)(C)C(=O)NCc1ccc(Br)c(c1)C(=O)Nc1ncc[nH]1