Reaction Details
TargetProstaglandin E synthase
LigandBDBM50142261
Substrate/Competitorn/a
Meas. Tech.ChEMBL_1552422 (CHEMBL3761673)
IC50 676±n/a nM
Citation Schiffler, MAAntonysamy, SBhattachar, SNCampanale, KMChandrasekhar, SCondon, BDesai, PVFisher, MJGroshong, CHarvey, AHickey, MJHughes, NEJones, SAKim, EJKuklish, SLLuz, JGNorman, BHRathmell, RERizzo, JRSeng, TWThibodeaux, SJWoods, TAYork, JSYu, XP Discovery and Characterization of 2-Acylaminoimidazole Microsomal Prostaglandin E Synthase-1 Inhibitors. J Med Chem59:194-205 (2016) 
 
Prostaglandin E synthase
Name:Prostaglandin E synthase
Type:Protein
Mol. Mass.:17112.22
Organism:Homo sapiens (Human)
Description:n/a
Residue:152
BDBM50142261
NameBDBM50142261
Synonyms:CHEMBL3758743
TypeSmall organic molecule
Emp. Form.C17H20F2N4O2
Mol. Mass.350.3631
SMILESCC(C)(C)C(=O)NCc1ccc(C(F)F)c(c1)C(=O)Nc1ncc[nH]1