Reaction Details
TargetProstaglandin E synthase
LigandBDBM50142264
Substrate/Competitorn/a
Meas. Tech.ChEMBL_1552422 (CHEMBL3761673)
IC50 385±n/a nM
Citation Schiffler, MAAntonysamy, SBhattachar, SNCampanale, KMChandrasekhar, SCondon, BDesai, PVFisher, MJGroshong, CHarvey, AHickey, MJHughes, NEJones, SAKim, EJKuklish, SLLuz, JGNorman, BHRathmell, RERizzo, JRSeng, TWThibodeaux, SJWoods, TAYork, JSYu, XP Discovery and Characterization of 2-Acylaminoimidazole Microsomal Prostaglandin E Synthase-1 Inhibitors. J Med Chem59:194-205 (2016) 
 
Prostaglandin E synthase
Name:Prostaglandin E synthase
Type:Protein
Mol. Mass.:17112.22
Organism:Homo sapiens (Human)
Description:n/a
Residue:152
BDBM50142264
NameBDBM50142264
Synonyms:CHEMBL3758186
TypeSmall organic molecule
Emp. Form.C17H21ClN4O2
Mol. Mass.348.827
SMILESCCC(C)(C)C(=O)NCc1ccc(Cl)c(c1)C(=O)Nc1ncc[nH]1