Reaction Details
TargetCollagenase 3
LigandBDBM50142267
Substrate/Competitorn/a
Meas. Tech.ChEMBL_1552458 (CHEMBL3761709)
Ki 4.2±n/a nM
Citation Ruminski, PGMassa, MStrohbach, JHanau, CESchmidt, MScholten, JAFletcher, TRHamper, BCCarroll, JNShieh, HSCaspers, NCollins, BGrapperhaus, MPalmquist, KECollins, JBaldus, JEHitchcock, JKleine, HPRogers, MDMcDonald, JMunie, GEMessing, DMPortolan, SWhiteley, LOSunyer, TSchnute, ME Discovery of N-(4-Fluoro-3-methoxybenzyl)-6-(2-(((2S,5R)-5-(hydroxymethyl)-1,4-dioxan-2-yl)methyl)-2H-tetrazol-5-yl)-2-methylpyrimidine-4-carboxamide. A Highly Selective and Orally Bioavailable Matrix Metalloproteinase-13 Inhibitor for the Potential Treatment of Osteoarthritis. J Med Chem59:313-27 (2016) 
 
Collagenase 3
Name:Collagenase 3
Type:Enzyme
Mol. Mass.:53808.06
Organism:Homo sapiens (Human)
Description:P45452
Residue:471
BDBM50142267
NameBDBM50142267
Synonyms:CHEMBL3758299
TypeSmall organic molecule
Emp. Form.C21H24FN7O5
Mol. Mass.473.4576
SMILESCOc1cc(CNC(=O)c2cc(nc(C)n2)-c2nnn(C[C@@H]3CO[C@@H](CO)CO3)n2)ccc1F