Reaction Details
TargetCollagenase 3
LigandBDBM50142435
Substrate/Competitorn/a
Meas. Tech.ChEMBL_1552458 (CHEMBL3761709)
Ki 110±n/a nM
Citation Ruminski, PGMassa, MStrohbach, JHanau, CESchmidt, MScholten, JAFletcher, TRHamper, BCCarroll, JNShieh, HSCaspers, NCollins, BGrapperhaus, MPalmquist, KECollins, JBaldus, JEHitchcock, JKleine, HPRogers, MDMcDonald, JMunie, GEMessing, DMPortolan, SWhiteley, LOSunyer, TSchnute, ME Discovery of N-(4-Fluoro-3-methoxybenzyl)-6-(2-(((2S,5R)-5-(hydroxymethyl)-1,4-dioxan-2-yl)methyl)-2H-tetrazol-5-yl)-2-methylpyrimidine-4-carboxamide. A Highly Selective and Orally Bioavailable Matrix Metalloproteinase-13 Inhibitor for the Potential Treatment of Osteoarthritis. J Med Chem59:313-27 (2016) 
 
Collagenase 3
Name:Collagenase 3
Type:Enzyme
Mol. Mass.:53808.06
Organism:Homo sapiens (Human)
Description:P45452
Residue:471
BDBM50142435
NameBDBM50142435
Synonyms:CHEMBL3759109
TypeSmall organic molecule
Emp. Form.C23H27FN6O2
Mol. Mass.438.4979
SMILESCc1cc(cc(n1)C(=O)NCc1cccc(F)c1)-c1nnn(C[C@H]2CC[C@H](CO)CC2)n1