Reaction Details
TargetStromelysin-1
LigandBDBM50142503
Substrate/Competitorn/a
Meas. Tech.ChEMBL_1552496 (CHEMBL3761850)
Ki>10000±n/a nM
Citation Ruminski, PGMassa, MStrohbach, JHanau, CESchmidt, MScholten, JAFletcher, TRHamper, BCCarroll, JNShieh, HSCaspers, NCollins, BGrapperhaus, MPalmquist, KECollins, JBaldus, JEHitchcock, JKleine, HPRogers, MDMcDonald, JMunie, GEMessing, DMPortolan, SWhiteley, LOSunyer, TSchnute, ME Discovery of N-(4-Fluoro-3-methoxybenzyl)-6-(2-(((2S,5R)-5-(hydroxymethyl)-1,4-dioxan-2-yl)methyl)-2H-tetrazol-5-yl)-2-methylpyrimidine-4-carboxamide. A Highly Selective and Orally Bioavailable Matrix Metalloproteinase-13 Inhibitor for the Potential Treatment of Osteoarthritis. J Med Chem59:313-27 (2016) 
 
Stromelysin-1
Name:Stromelysin-1
Type:Enzyme
Mol. Mass.:53973.13
Organism:Homo sapiens (Human)
Description: P08254
Residue:477
BDBM50142503
NameBDBM50142503
Synonyms:CHEMBL3759520
TypeSmall organic molecule
Emp. Form.C24H30N6O3
Mol. Mass.450.5334
SMILESCOc1cccc(CNC(=O)c2cc(cc(C)n2)-c2nnn(C[C@H]3CC[C@H](CO)CC3)n2)c1