Reaction Details
TargetSolute carrier family 22 member 8
LigandBDBM50234348
Substrate/Competitorn/a
Meas. Tech.ChEMBL_1552528 (CHEMBL3762006)
IC50 59000±n/a nM
Citation Ruminski, PGMassa, MStrohbach, JHanau, CESchmidt, MScholten, JAFletcher, TRHamper, BCCarroll, JNShieh, HSCaspers, NCollins, BGrapperhaus, MPalmquist, KECollins, JBaldus, JEHitchcock, JKleine, HPRogers, MDMcDonald, JMunie, GEMessing, DMPortolan, SWhiteley, LOSunyer, TSchnute, ME Discovery of N-(4-Fluoro-3-methoxybenzyl)-6-(2-(((2S,5R)-5-(hydroxymethyl)-1,4-dioxan-2-yl)methyl)-2H-tetrazol-5-yl)-2-methylpyrimidine-4-carboxamide. A Highly Selective and Orally Bioavailable Matrix Metalloproteinase-13 Inhibitor for the Potential Treatment of Osteoarthritis. J Med Chem59:313-27 (2016) 
 
Solute carrier family 22 member 8
Name:Solute carrier family 22 member 8
Type:PROTEIN
Mol. Mass.:59870.13
Organism:Homo sapiens (Human)
Description:ChEMBL_1486920
Residue:542
BDBM50234348
NameBDBM50234348
Synonyms:4-((6-(4-methoxybenzylcarbamoyl)-4-oxopyrido[3,4-d]pyrimidin-3(4H)-yl)methyl)benzoic acid CHEMBL270050
TypeSmall organic molecule
Emp. Form.C24H20N4O5
Mol. Mass.444.4394
SMILESCOc1ccc(CNC(=O)c2cc3c(cn2)ncn(Cc2ccc(cc2)C(O)=O)c3=O)cc1