Reaction Details
TargetDelta-type opioid receptor
LigandBDBM50142620
Substrate/Competitorn/a
Meas. Tech.ChEMBL_1552794 (CHEMBL3760687)
EC50 3±n/a nM
Citation Turnaturi, RAricò, GRonsisvalle, GParenti, CPasquinucci, L Multitarget opioid ligands in pain relief: New players in an old game. Eur J Med Chem108:211-28 (2016) 
 
Delta-type opioid receptor
Name:Delta-type opioid receptor
Type:Enzyme Catalytic Domain
Mol. Mass.:40577.25
Organism:MOUSE
Description:P32300
Residue:372
BDBM50142620
NameBDBM50142620
Synonyms:CHEMBL3758712
TypeSmall organic molecule
Emp. Form.C29H32N4O4
Mol. Mass.500.5888
SMILESCc1cc(O)cc(C)c1C[C@H](N)C(=O)N1Cc2ccccc2C[C@@H]1C(=O)NCC(=O)Nc1ccccc1