Reaction Details
TargetDelta-type opioid receptor
LigandBDBM50142703
Substrate/Competitorn/a
Meas. Tech.ChEMBL_1552644 (CHEMBL3762583)
IC50 8.3±n/a nM
Citation Turnaturi, RAricò, GRonsisvalle, GParenti, CPasquinucci, L Multitarget opioid ligands in pain relief: New players in an old game. Eur J Med Chem108:211-28 (2016) 
 
Delta-type opioid receptor
Name:Delta-type opioid receptor
Type:G Protein-Coupled Receptor (GPCR)
Mol. Mass.:40382.98
Organism:Homo sapiens (Human)
Description:Competition binding assays were carried out using membrane preparations from transfected HN9.10 cells that constitutively expressed the delta opioid receptor.
Residue:372
BDBM50142703
NameBDBM50142703
Synonyms:CHEMBL3759541
TypeSmall organic molecule
Emp. Form.C35H36N4O4
Mol. Mass.576.6847
SMILESCc1cc(O)cc(C)c1C[C@H](N)C(=O)N1Cc2ccccc2C[C@@H]1C(=O)NCC(=O)N(c1ccccc1)c1ccccc1