Reaction Details
TargetMu-type opioid receptor
LigandBDBM50123658
Substrate/Competitorn/a
Meas. Tech.ChEMBL_1552632 (CHEMBL3762571)
IC50 1±n/a nM
Citation Turnaturi, RAricò, GRonsisvalle, GParenti, CPasquinucci, L Multitarget opioid ligands in pain relief: New players in an old game. Eur J Med Chem108:211-28 (2016) 
 
Mu-type opioid receptor
Name:Mu-type opioid receptor
Type:Enzyme Catalytic Domain
Mol. Mass.:11165.58
Organism:GUINEA PIG
Description:P97266
Residue:98
BDBM50123658
NameBDBM50123658
Synonyms:3-[(R)-((2S,5R)-4-Allyl-2,5-dimethyl-piperazin-1-yl)-(3-hydroxy-phenyl)-methyl]-N-(3-fluoro-phenyl)-N-methyl-benzamide | CHEMBL155892
TypeSmall organic molecule
Emp. Form.C30H34FN3O2
Mol. Mass.487.6083
SMILESC[C@@H]1CN([C@@H](c2cccc(O)c2)c2cccc(c2)C(=O)N(C)c2cccc(F)c2)[C@@H](C)CN1CC=C